Reaction Details
TargetGlutamate receptor ionotropic, NMDA 1
LigandBDBM17660
Substrate/Competitorn/a
Ki>10000±n/a nM
CommentsPDSP_1580
Citation Murphy, DEHutchison, AJHurt, SDWilliams, MSills, MA Characterization of the binding of [3H]-CGS 19755: a novel N-methyl-D-aspartate antagonist with nanomolar affinity in rat brain. Br J Pharmacol95:932-8 (1988) 
 
Glutamate receptor ionotropic, NMDA 1
Name:Glutamate receptor ionotropic, NMDA 1
Type:Enzyme Catalytic Domain
Mol. Mass.:105533.40
Organism:RAT
Description:P35439
Residue:938
BDBM17660
NameBDBM17660
Synonyms:(2S)-2-amino-3-(3,5-dioxo-1,2,4-oxadiazolidin-2-yl)propanoic acid CHEMBL279956 Quisqualate, L | quisqualic acid
TypeSmall organic molecule
Emp. Form.C5H7N3O5
Mol. Mass.189.1262
SMILESN[C@@H](Cn1oc(=O)[nH]c1=O)C(O)=O