Reaction Details
TargetAlpha-2C adrenergic receptor
LigandBDBM50019848
Substrate/Competitorn/a
Ki 2±n/a nM
CommentsPDSP_959
Citation Hieble, JPDeMarinis, RMFowler, PJMatthews, WD Selective alpha-2 adrenoceptor blockade by SK&F 86466: in vitro characterization of receptor selectivity. J Pharmacol Exp Ther236:90-6 (1986) Alpha-2C adrenergic receptor
Name:Alpha-2C adrenergic receptor
Type:Enzyme Catalytic Domain
Mol. Mass.:49890.50
Organism:RAT
Description:adrenergic Alpha2 0 RAT::P22086
Residue:458
BDBM50019848
NameBDBM50019848
Synonyms:2-(2,3-dihydro-1,4-benzodioxin-2-yl)-4,5-dihydro-1H-imidazole CHEMBL10316 US8633208, Idazoxan
TypeSmall organic molecule
Emp. Form.C11H12N2O2
Mol. Mass.204.2252
SMILESC1CN=C(N1)C1COc2ccccc2O1