Reaction Details
TargetAlpha-2B adrenergic receptor
LigandBDBM50026636
Substrate/Competitorn/a
Ki 1±n/a nM
CommentsPDSP_1590
Citation Hieble, JPDeMarinis, RMFowler, PJMatthews, WD Selective alpha-2 adrenoceptor blockade by SK&F 86466: in vitro characterization of receptor selectivity. J Pharmacol Exp Ther236:90-6 (1986) Alpha-2B adrenergic receptor
Name:Alpha-2B adrenergic receptor
Type:Enzyme Catalytic Domain
Mol. Mass.:42242.60
Organism:Dog
Description:Q2MDQ0
Residue:387
BDBM50026636
NameBDBM50026636
Synonyms:17alpha-hydroxy-20alpha-yohimban-16beta-carboxylic acid methyl ester RAUWOLSCINE HYDROCHLORIDE corynanthidine mesoyohimbine methyl 17alpha-hydroxy-20alpha-yohimban-16beta-carboxylate | rauwolscine
TypeSmall organic molecule
Emp. Form.C21H26N2O3
Mol. Mass.354.4427
SMILESCOC(=O)[C@@H]1[C@@H](O)CC[C@@H]2CN3CCc4c([nH]c5ccccc45)[C@@H]3C[C@H]12