Reaction Details
TargetAlpha-2B adrenergic receptor
LigandBDBM66983
Substrate/Competitorn/a
Ki 42±n/a nM
CommentsPDSP_1727
Citation Hieble, JPDeMarinis, RMFowler, PJMatthews, WD Selective alpha-2 adrenoceptor blockade by SK&F 86466: in vitro characterization of receptor selectivity. J Pharmacol Exp Ther236:90-6 (1986) Alpha-2B adrenergic receptor
Name:Alpha-2B adrenergic receptor
Type:Enzyme Catalytic Domain
Mol. Mass.:42242.60
Organism:Dog
Description:Q2MDQ0
Residue:387
BDBM66983
NameBDBM66983
Synonyms:6-chloranyl-3-methyl-1,2,4,5-tetrahydro-3-benzazepine;hydrochloride CHEMBL123349 SKF 86466 SMR001254100 | cid_10220250
TypeSmall organic molecule
Emp. Form.C11H14ClN
Mol. Mass.195.689
SMILESCN1CCc2cccc(Cl)c2CC1