Reaction Details
TargetSigma non-opioid intracellular receptor 1
LigandBDBM50169774
Substrate/Competitorn/a
Ki 1350±n/a nM
CommentsPDSP_1935
Citation Korstanje, CSprenkels, RDoods, HNHugtenburg, JGBoddeke, EBatink, HDThoolen, MJVan Zwieten, PA Characterization of flufylline, fluprofylline, ritanserin, butanserin and R 56413 with respect to in-vivo alpha 1-,alpha 2- and 5-HT2-receptor antagonism and in-vitro affinity for alpha 1-,alpha 2- and 5-HT2-receptors: comparison with ketanserin. J Pharm Pharmacol38:374-9 (1986) 
 
Sigma non-opioid intracellular receptor 1
Name:Sigma non-opioid intracellular receptor 1
Type:Protein
Mol. Mass.:25307.17
Organism:Cavia porcellus (Guinea pig)
Description:Q60492
Residue:223
BDBM50169774
NameBDBM50169774
Synonyms:2-(3,4-Dichloro-phenyl)-N-methyl-N-(2-pyrrolidin-1-yl-cyclohexyl)-acetamide; compound with methanesulfonic acid U-50488H | U50,488H
TypeSmall organic molecule
Emp. Form.C19H26Cl2N2O
Mol. Mass.369.329
SMILESCN(C1CCCC[C@H]1N1CCCC1)C(=O)Cc1ccc(Cl)c(Cl)c1