Reaction Details
TargetAlpha-2C adrenergic receptor
LigandBDBM36024
Substrate/Competitorn/a
Ki 1467±n/a nM
CommentsPDSP_1482
Citation Boyajian, CLLeslie, FM Pharmacological evidence for alpha-2 adrenoceptor heterogeneity: differential binding properties of [3H]rauwolscine and [3H]idazoxan in rat brain. J Pharmacol Exp Ther241:1092-8 (1987) Alpha-2C adrenergic receptor
Name:Alpha-2C adrenergic receptor
Type:Enzyme Catalytic Domain
Mol. Mass.:49890.50
Organism:RAT
Description:adrenergic Alpha2 0 RAT::P22086
Residue:458
BDBM36024
NameBDBM36024
Synonyms:(R)-(-)-phenylephrine Phenylephrine,(-)
TypeGuest
Emp. Form.C9H14NO2
Mol. Mass.168.2124
SMILESC[NH2+]C[C@H](O)c1cccc(O)c1