Reaction Details
TargetD(1A) dopamine receptor
LigandBDBM50132693
Substrate/Competitorn/a
Ki 820±n/a nM
CommentsPDSP_536
Citation Andersen, PH Comparison of the pharmacological characteristics of [3H]raclopride and [3H]SCH 23390 binding to dopamine receptors in vivo in mouse brain. Eur J Pharmacol146:113-20 (1988) 
 
D(1A) dopamine receptor
Name:D(1A) dopamine receptor
Type:Enzyme
Mol. Mass.:49613.93
Organism:Mus musculus (Mouse)
Description:Q61616
Residue:446
BDBM50132693
NameBDBM50132693
Synonyms:4-Amino-N-(1-benzyl-piperidin-4-yl)-5-chloro-2-methoxy-benzamide 4-amino-N-(1-benzylpiperidin-4-yl)-5-chloro-2-methoxybenzamide Clebopride
TypeSmall organic molecule
Emp. Form.C20H24ClN3O2
Mol. Mass.373.876
SMILESCOc1cc(N)c(Cl)cc1C(=O)NC1CCN(Cc2ccccc2)CC1