Reaction Details
TargetD(1A) dopamine receptor
LigandBDBM81985
Substrate/Competitorn/a
Ki 17±n/a nM
CommentsPDSP_3963
Citation Andersen, PH Comparison of the pharmacological characteristics of [3H]raclopride and [3H]SCH 23390 binding to dopamine receptors in vivo in mouse brain. Eur J Pharmacol146:113-20 (1988) 
 
D(1A) dopamine receptor
Name:D(1A) dopamine receptor
Type:Enzyme
Mol. Mass.:49613.93
Organism:Mus musculus (Mouse)
Description:Q61616
Residue:446
BDBM81985
NameBDBM81985
Synonyms:CAS_42239-60-1 Tilozepine
TypeSmall organic molecule
Emp. Form.C17H18ClN3S
Mol. Mass.331.863
SMILESCN1CCN(CC1)C1=Nc2cc(Cl)ccc2Cc2sccc12