Reaction Details
TargetD(2) dopamine receptor
LigandBDBM81775
Substrate/Competitorn/a
Ki 1300±n/a nM
CommentsPDSP_3962
Citation Andersen, PH Comparison of the pharmacological characteristics of [3H]raclopride and [3H]SCH 23390 binding to dopamine receptors in vivo in mouse brain. Eur J Pharmacol146:113-20 (1988) 
 
D(2) dopamine receptor
Name:D(2) dopamine receptor
Type:Enzyme
Mol. Mass.:50957.64
Organism:Mus musculus (Mouse)
Description:P61168
Residue:444
BDBM81775
NameBDBM81775
Synonyms:Sulpiride-R Sulpiride-high,(-) | Sulpiride-low,(-)
Typen/a
Emp. Form.C15H23N3O4S
Mol. Mass.341.426
SMILESCCN1CCC[C@@H]1CNC(=O)c1cc(ccc1OC)S(N)(=O)=O