Reaction Details
Target5-hydroxytryptamine receptor 1A/1B/1D/2C
LigandBDBM78576
Substrate/Competitorn/a
Ki 1408.45±n/a nM
CommentsPDSP_1851
Citation Richelson, E Neuroleptic binding to human brain receptors: relation to clinical effects. Ann N Y Acad Sci537:435-42 (1988) 
 
5-hydroxytryptamine receptor 1A/1B/1D/2C
Name:5-hydroxytryptamine receptor 1A/1B/1D/2C
Synonyms:5-HT1
Type:n/a
Mol. Mass.:n/a
Description:TL
Components:This complex has 0 components.
Component 1
Name:5-hydroxytryptamine receptor 1A
Type:n/a
Mol. Mass.:46122.49
Organism:Homo sapiens (Human)
Description:n/a
Residue:422
Component 2
Name:5-hydroxytryptamine receptor 1B
Synonyms:5-HT-1B 5-HT1B 5HT1B_HUMAN HTR1DB Serotonin (5-HT) receptor Serotonin Receptor 1B
Type:G Protein-Coupled Receptor (GPCR)
Mol. Mass.:43579.17
Organism:Homo sapiens (Human)
Description:Receptor binding assays were performed using human clone stably expressed in CHO cells
Residue:390
Component 3
Name:5-hydroxytryptamine receptor 2C
Synonyms:5-HT-2C 5-HT2C-INI 5-HTR2C 5-hydroxytryptamine receptor 2C (5-HT-2C) 5HT-1C HTR1C Serotonin (5-HT3) receptor Serotonin Receptor 2C
Type:G Protein-Coupled Receptor (GPCR)
Mol. Mass.:51836.79
Organism:Homo sapiens (Human)
Description:P28335
Residue:458
Component 4
Name:5-hydroxytryptamine receptor 1D
Synonyms:5-HT-1D 5-HT1D 5HT1D_HUMAN HTR1DA Serotonin (5-HT) receptor | Serotonin Receptor 1D
Type:G Protein-Coupled Receptor (GPCR)
Mol. Mass.:41920.63
Organism:Homo sapiens (Human)
Description:Receptor binding assays were performed using human clone stably expressed in CHO cells.
Residue:377
BDBM78576
NameBDBM78576
Synonyms:CIS-THIOTHIXENE SMR000058396 cid_941651 | med.21724, Compound Thiothixene
TypeSmall organic molecule
Emp. Form.C23H29N3O2S2
Mol. Mass.443.625
SMILESCN(C)S(=O)(=O)c1ccc2Sc3ccccc3\C(=C\CCN3CCN(C)CC3)c2c1