Reaction Details
Target5-hydroxytryptamine receptor 2C
LigandBDBM79181
Substrate/Competitorn/a
Ki 14.08±n/a nM
CommentsPDSP_1908
Citation Richelson, E Neuroleptic binding to human brain receptors: relation to clinical effects. Ann N Y Acad Sci537:435-42 (1988) 
 
5-hydroxytryptamine receptor 2C
Name:5-hydroxytryptamine receptor 2C
Type:G Protein-Coupled Receptor (GPCR)
Mol. Mass.:51836.79
Organism:Homo sapiens (Human)
Description:P28335
Residue:458
BDBM79181
NameBDBM79181
Synonyms:10-[3-(4-methyl-1-piperazinyl)propyl]-2-(trifluoromethyl)phenothiazine;hydrochloride 10-[3-(4-methylpiperazino)propyl]-2-(trifluoromethyl)phenothiazine;hydrochloride SMR000059133 TRIFLUOPERAZINE DIHYDROCHLORIDE US11542290, Compound Trifluoperazine cid_5566
TypeSmall organic molecule
Emp. Form.C21H24F3N3S
Mol. Mass.407.496
SMILESCN1CCN(CCCN2c3ccccc3Sc3ccc(cc23)C(F)(F)F)CC1