Reaction Details
TargetHistamine H1 receptor
LigandBDBM50017674
Substrate/Competitorn/a
Ki 14.08±n/a nM
CommentsPDSP_673
Citation Richelson, E Neuroleptic binding to human brain receptors: relation to clinical effects. Ann N Y Acad Sci537:435-42 (1988) 
 
Histamine H1 receptor
Name:Histamine H1 receptor
Type:G Protein-Coupled Receptor (GPCR)
Mol. Mass.:55808.72
Organism:Homo sapiens (Human)
Description:Cell pellets from SK-N-MC cells transfected with human H1 receptor were used in binding assay.
Residue:487
BDBM50017674
NameBDBM50017674
Synonyms:(2-Benzhydryloxy-ethyl)-dimethyl-amine 2-(diphenylmethoxy)-N,N-dimethylethanamine Beldin Benadryl CHEMBL657 DIPHENHYDRAMINE Diphen N-[2-(BENZHYDRYLOXY)ETHYL]-N,N-DIMETHYLAMINE US9138431, DIPHENHYDRAMINE (Benadryl) | US9333199, DIPHENHYDRAMINE (Benadryl)
TypeSmall organic molecule
Emp. Form.C17H21NO
Mol. Mass.255.3547
SMILESCN(C)CCOC(c1ccccc1)c1ccccc1