Reaction Details
Target5-hydroxytryptamine receptor 2A
LigandBDBM50073444
Substrate/Competitorn/a
Ki 1.94±n/a nM
CommentsPDSP_1905
Citation Shank, RPVaught, JLPelley, KASetler, PEMcComsey, DFMaryanoff, BE McN-5652: a highly potent inhibitor of serotonin uptake. J Pharmacol Exp Ther247:1032-8 (1988) 5-hydroxytryptamine receptor 2A
Name:5-hydroxytryptamine receptor 2A
Type:G Protein-Coupled Receptor (GPCR)
Mol. Mass.:52852.05
Organism:Rattus norvegicus (rat)
Description:Rat cortex membranes 5-HT2A receptors.
Residue:471
BDBM50073444
NameBDBM50073444
Synonyms:2-{3-[4-(3-chlorophenyl)piperazin-1-yl]propyl}[1,2,4]triazolo[4,3-a]pyridin-3(2H)-one TRAZODONE
TypeSmall organic molecule
Emp. Form.C19H22ClN5O
Mol. Mass.371.864
SMILESClc1cccc(c1)N1CCN(CCCn2nc3ccccn3c2=O)CC1