Reaction Details
TargetNorepinephrine transporter
LigandBDBM50028091
Substrate/Competitorn/a
Ki 299±n/a nM
CommentsPDSP_844
Citation Shank, RPVaught, JLPelley, KASetler, PEMcComsey, DFMaryanoff, BE McN-5652: a highly potent inhibitor of serotonin uptake. J Pharmacol Exp Ther247:1032-8 (1988) Norepinephrine transporter
Name:Norepinephrine transporter
Synonyms:n/a
Type:Enzyme Catalytic Domain
Mol. Mass.:2082.45
Organism:RAT
Description:Norepinephrine transporter 0 RAT::Q9JIA2
Residue:19
MLLARMKPQVQPELGGADQ
BDBM50028091
NameBDBM50028091
TypeSmall organic molecule
Emp. Form.C15H21F3N2O2
Mol. Mass.318.3346
SMILESCOCCCC\C(=N/OCCN)c1ccc(cc1)C(F)(F)F