Reaction Details
TargetD(2) dopamine receptor
LigandBDBM50241107
Substrate/Competitorn/a
Ki 1.2±n/a nM
CommentsPDSP_726
Citation Lin, CMcGonigle, PMolinoff, PB Characterization of D-2 dopamine receptors in a tumor of the rat anterior pituitary gland. J Pharmacol Exp Ther242:950-6 (1987) D(2) dopamine receptor
Name:D(2) dopamine receptor
Type:G Protein-Coupled Receptor (GPCR)
Mol. Mass.:50931.60
Organism:Rattus norvegicus (rat)
Description:P61169
Residue:444
BDBM50241107
NameBDBM50241107
Synonyms:1-(3-(4-(5-chloro-2-oxo-2,3-dihydrobenzo[d]imidazol-1-yl)piperidin-1-yl)propyl)-1H-benzo[d]imidazol-2(3H)-one 5-Chloro-1-{1-[3-(2-oxo-2,3-dihydro-benzoimidazol-1-yl)-propyl]-piperidin-4-yl}-1,3-dihydro-benzoimidazol-2-one(domperidone) 5-chloro-1-{1-[3-(2-oxo-2,3-dihydro-benzoimidazol-1-yl)-propyl]-piperidin-4-yl}-1,3-dihydro-benzoimidazol-2-one CHEMBL219916 DOMPERIDONE5-Chloro-1-{1-[3-(2-oxo-2,3-dihydro-benzoimidazol-1-yl)-propyl]-piperidin-4-yl}-1,3-dihydro-benzoimidazol-2-one US9132134, Domperidone
TypeSmall organic molecule
Emp. Form.C22H24ClN5O2
Mol. Mass.425.911
SMILESClc1ccc2n(C3CCN(CCCn4c5ccccc5[nH]c4=O)CC3)c(=O)[nH]c2c1