Reaction Details
TargetThromboxane A2 receptor
LigandBDBM50018531
Substrate/Competitorn/a
Ki 3.6±n/a nM
CommentsPDSP_1934
Citation Hedberg, AHall, SEOgletree, MLHarris, DNLiu, EC Characterization of [5,6-3H]SQ 29,548 as a high affinity radioligand, binding to thromboxane A2/prostaglandin H2-receptors in human platelets. J Pharmacol Exp Ther245:786-92 (1988) Thromboxane A2 receptor
Name:Thromboxane A2 receptor
Type:Enyzme
Mol. Mass.:37445.28
Organism:Homo sapiens (Human)
Description:P21731
Residue:343
BDBM50018531
NameBDBM50018531
Synonyms:(Z)-7-[(S)-6-((E)-(S)-3-Hydroxy-oct-1-enyl)-2-oxa-bicyclo[2.2.1]hept-5-yl]-hept-5-enoic acid CHEMBL73010 U46619
TypeSmall organic molecule
Emp. Form.C21H34O4
Mol. Mass.350.4923
SMILESCCCCC[C@H](O)\C=C\C1[C@H]2C[C@H](CO2)[C@@H]1C\C=C/CCCC(O)=O