Reaction Details
TargetSodium-dependent serotonin transporter
LigandBDBM25761
Substrate/Competitorn/a
Ki 3700±n/a nM
CommentsPDSP_1538
Citation Kovachich, GBAronson, CEBrunswick, DJFrazer, A Quantitative autoradiography of serotonin uptake sites in rat brain using [3H]cyanoimipramine. Brain Res454:78-88 (1988) 
 
Sodium-dependent serotonin transporter
Name:Sodium-dependent serotonin transporter
Type:Multi-pass membrane protein
Mol. Mass.:70168.43
Organism:Rattus norvegicus (rat)
Description:P31652
Residue:630
BDBM25761
NameBDBM25761
Synonyms:Anapriline CHEMBL27 PROPRANOLOL, d PROPRANOLOL,(+) Propanolol Propranolol | [2-hydroxy-3-(naphthalen-1-yloxy)propyl](propan-2-yl)amine
TypeSmall organic molecule
Emp. Form.C16H21NO2
Mol. Mass.259.3434
SMILESCC(C)NCC(O)COc1cccc2ccccc12