Reaction Details
TargetGlutamate receptor ionotropic, NMDA 1
LigandBDBM17660
Substrate/Competitorn/a
Ki 260±n/a nM
CommentsPDSP_3724
Citation Robinson, MBCrooks, SLJohnson, RLKoerner, JF Displacement of DL-[3H]-2-amino-4-phosphonobutanoic acid ( [3H]APB) binding with methyl-substituted APB analogues and glutamate agonists. Biochemistry24:2401-5 (1985) 
 
Glutamate receptor ionotropic, NMDA 1
Name:Glutamate receptor ionotropic, NMDA 1
Type:Enzyme Catalytic Domain
Mol. Mass.:105533.40
Organism:RAT
Description:P35439
Residue:938
BDBM17660
NameBDBM17660
Synonyms:(2S)-2-amino-3-(3,5-dioxo-1,2,4-oxadiazolidin-2-yl)propanoic acid CHEMBL279956 Quisqualate, L | quisqualic acid
TypeSmall organic molecule
Emp. Form.C5H7N3O5
Mol. Mass.189.1262
SMILESN[C@@H](Cn1oc(=O)[nH]c1=O)C(O)=O