Reaction Details
TargetAdenosine receptor A1
LigandBDBM82025
Substrate/Competitorn/a
Ki 10.2±n/a nM
CommentsPDSP_2503
Citation Bruns, RFLu, GHPugsley, TA Characterization of the A2 adenosine receptor labeled by [3H]NECA in rat striatal membranes. Mol Pharmacol29:331-46 (1986) Adenosine receptor A1
Name:Adenosine receptor A1
Type:Protein
Mol. Mass.:36704.13
Organism:Rattus norvegicus (rat)
Description:n/a
Residue:326
BDBM82025
NameBDBM82025
Synonyms:1,3-Dipropyl-8-phenylxanthine CAS_128784 NSC_128784
TypeSmall organic molecule
Emp. Form.C17H20N4O2
Mol. Mass.312.3663
SMILESCCCn1c2nc([nH]c2c(=O)n(CCC)c1=O)-c1ccccc1