Reaction Details
TargetAdenosine receptor A1
LigandBDBM82054
Substrate/Competitorn/a
Ki 28.1±n/a nM
CommentsPDSP_2519
Citation Bruns, RFLu, GHPugsley, TA Characterization of the A2 adenosine receptor labeled by [3H]NECA in rat striatal membranes. Mol Pharmacol29:331-46 (1986) Adenosine receptor A1
Name:Adenosine receptor A1
Type:Protein
Mol. Mass.:36704.13
Organism:Rattus norvegicus (rat)
Description:n/a
Residue:326
BDBM82054
NameBDBM82054
Synonyms:Ado-5'-(2-hydroxyethyl)carboxamide
Typen/a
Emp. Form.C13H18N6O5
Mol. Mass.338.3192
SMILESNC(=O)CCOC[C@H]1O[C@H]([C@H](O)[C@@H]1O)n1cnc2c(N)ncnc12