Reaction Details
TargetAdenosine receptor A1
LigandBDBM82049
Substrate/Competitorn/a
Ki 72.6±n/a nM
CommentsPDSP_2518
Citation Bruns, RFLu, GHPugsley, TA Characterization of the A2 adenosine receptor labeled by [3H]NECA in rat striatal membranes. Mol Pharmacol29:331-46 (1986) Adenosine receptor A1
Name:Adenosine receptor A1
Type:Protein
Mol. Mass.:36704.13
Organism:Rattus norvegicus (rat)
Description:n/a
Residue:326
BDBM82049
NameBDBM82049
Synonyms:Ado-5'-carboxamide
Typen/a
Emp. Form.C11H14N6O5
Mol. Mass.310.2661
SMILESNC(=O)OC[C@H]1O[C@H]([C@H](O)[C@@H]1O)n1cnc2c(N)ncnc12