Reaction Details
TargetAdenosine receptor A2a
LigandBDBM50009525
Substrate/Competitorn/a
Ki 63.2±n/a nM
CommentsPDSP_2515
Citation Bruns, RFLu, GHPugsley, TA Characterization of the A2 adenosine receptor labeled by [3H]NECA in rat striatal membranes. Mol Pharmacol29:331-46 (1986) Adenosine receptor A2a
Name:Adenosine receptor A2a
Type:G Protein-Coupled Receptor (GPCR)
Mol. Mass.:45015.65
Organism:Rattus norvegicus (rat)
Description:Rat A2A receptors expressed in CHO cells.
Residue:410
BDBM50009525
NameBDBM50009525
Synonyms:2-CI Adenosine 2-Chloroado CHEMBL285819
TypeSmall organic molecule
Emp. Form.C10H12ClN5O4
Mol. Mass.301.686
SMILESNc1nc(Cl)nc2n(cnc12)[C@@H]1O[C@H](CO)[C@@H](O)[C@H]1O