Reaction Details
TargetVoltage-dependent L-type calcium channel subunit alpha-1C
LigandBDBM82061
Substrate/Competitorn/a
Ki 21.4±n/a nM
CommentsPDSP_2653
Citation Reynolds, IJSnowman, AMSnyder, SH (-)-[3H] desmethoxyverapamil labels multiple calcium channel modulator receptors in brain and skeletal muscle membranes: differentiation by temperature and dihydropyridines. J Pharmacol Exp Ther237:731-8 (1986) Voltage-dependent L-type calcium channel subunit alpha-1C
Name:Voltage-dependent L-type calcium channel subunit alpha-1C
Type:Enzyme Catalytic Domain
Mol. Mass.:243492.26
Organism:RAT
Description:Calcium channel 0 RAT::P22002
Residue:2169
BDBM82061
NameBDBM82061
Synonyms:CAS_119442 GALLOPAMIL | NSC_119442
TypeSmall organic molecule
Emp. Form.C28H40N2O5
Mol. Mass.484.6276
SMILESCOc1ccc(CCN(C)CCCC(C#N)(C(C)C)c2cc(OC)c(OC)c(OC)c2)cc1OC