Reaction Details
TargetVoltage-dependent L-type calcium channel subunit alpha-1C
LigandBDBM82057
Substrate/Competitorn/a
Ki 45.5±n/a nM
CommentsPDSP_2662
Citation Reynolds, IJSnowman, AMSnyder, SH (-)-[3H] desmethoxyverapamil labels multiple calcium channel modulator receptors in brain and skeletal muscle membranes: differentiation by temperature and dihydropyridines. J Pharmacol Exp Ther237:731-8 (1986) Voltage-dependent L-type calcium channel subunit alpha-1C
Name:Voltage-dependent L-type calcium channel subunit alpha-1C
Type:Enzyme Catalytic Domain
Mol. Mass.:243492.26
Organism:RAT
Description:Calcium channel 0 RAT::P22002
Residue:2169
BDBM82057
NameBDBM82057
Synonyms:CAS_107928 D888,(+) NSC_107928 | NSC_65832
TypeSmall organic molecule
Emp. Form.C26H36N2O3
Mol. Mass.424.5756
SMILESCOc1cccc(CCN(C)CCCC(C#N)(C(C)C)c2ccc(OC)c(OC)c2)c1