Reaction Details
TargetVoltage-dependent L-type calcium channel subunit alpha-1C
LigandBDBM23619
Substrate/Competitorn/a
Ki 188±n/a nM
CommentsPDSP_2660
Citation Reynolds, IJSnowman, AMSnyder, SH (-)-[3H] desmethoxyverapamil labels multiple calcium channel modulator receptors in brain and skeletal muscle membranes: differentiation by temperature and dihydropyridines. J Pharmacol Exp Ther237:731-8 (1986) Voltage-dependent L-type calcium channel subunit alpha-1C
Name:Voltage-dependent L-type calcium channel subunit alpha-1C
Type:Enzyme Catalytic Domain
Mol. Mass.:243492.26
Organism:RAT
Description:Calcium channel 0 RAT::P22002
Residue:2169
BDBM23619
NameBDBM23619
Synonyms:2-{4-[4,4-bis(4-fluorophenyl)butyl]piperazin-1-yl}-N-(2,6-dimethylphenyl)acetamide Clinium Lidoflazine | Ordiflazine
TypeSmall organic molecule
Emp. Form.C30H35F2N3O
Mol. Mass.491.6152
SMILESCc1cccc(C)c1NC(=O)CN1CCN(CCCC(c2ccc(F)cc2)c2ccc(F)cc2)CC1