Reaction Details
TargetVoltage-dependent L-type calcium channel subunit alpha-1C
LigandBDBM50017715
Substrate/Competitorn/a
Ki 1441±n/a nM
CommentsPDSP_2657
Citation Reynolds, IJSnowman, AMSnyder, SH (-)-[3H] desmethoxyverapamil labels multiple calcium channel modulator receptors in brain and skeletal muscle membranes: differentiation by temperature and dihydropyridines. J Pharmacol Exp Ther237:731-8 (1986) Voltage-dependent L-type calcium channel subunit alpha-1C
Name:Voltage-dependent L-type calcium channel subunit alpha-1C
Type:Enzyme Catalytic Domain
Mol. Mass.:243492.26
Organism:RAT
Description:Calcium channel 0 RAT::P22002
Residue:2169
BDBM50017715
NameBDBM50017715
Synonyms:CHEMBL125737 [2-(3,4-Dimethoxy-phenyl)-ethyl]-{3-[2-(3,4-dimethoxy-phenyl)-1,1,3,3-tetraoxo-1lambda*6*,3lambda*6*-[1,3]dithian-2-yl]-propyl}-methyl-amine | [2-(3,4-dimethoxy-phenyl)-ethyl]-{3-[2-(3,4-dimethoxy-phenyl)-1,1,3,3-tetraoxo-1lambda6,3lambda6-[1,3]dithian-2-yl]-propyl}-methyl-amine
TypeSmall organic molecule
Emp. Form.C26H37NO8S2
Mol. Mass.555.704
SMILESCOc1ccc(CCN(C)CCCC2(c3ccc(OC)c(OC)c3)S(=O)(=O)CCCS2(=O)=O)cc1OC