Reaction Details
TargetGlutamate receptor ionotropic, NMDA 1
LigandBDBM50001031
Substrate/Competitorn/a
Ki 75±n/a nM
CommentsPDSP_1715
Citation Largent, BLGundlach, ALSnyder, SH Pharmacological and autoradiographic discrimination of sigma and phencyclidine receptor binding sites in brain with (+)-[3H]SKF 10,047, (+)-[3H]-3-[3-hydroxyphenyl]-N-(1-propyl)piperidine and [3H]-1-[1-(2-thienyl)cyclohexyl]piperidine. J Pharmacol Exp Ther238:739-48 (1986) Glutamate receptor ionotropic, NMDA 1
Name:Glutamate receptor ionotropic, NMDA 1
Type:Enzyme Catalytic Domain
Mol. Mass.:105533.40
Organism:RAT
Description:P35439
Residue:938
BDBM50001031
NameBDBM50001031
Synonyms:3-Allyl-6,11-dimethyl-1,2,3,4,5,6-hexahydro-2,6-methano-benzo[d]azocin-8-ol SKF 10,047 (+) SKF 10047
TypeSmall organic molecule
Emp. Form.C17H23NO
Mol. Mass.257.3706
SMILESC[C@H]1[C@H]2Cc3ccc(O)cc3[C@@]1(C)CCN2CC=C