Reaction Details
TargetAdenosine receptor A1
LigandBDBM50009552
Substrate/Competitorn/a
Ki 2.5±n/a nM
CommentsPDSP_506
Citation Leung, EKwatra, MMHosey, MMGreen, RD Characterization of cardiac A1 adenosine receptors by ligand binding and photoaffinity labeling. J Pharmacol Exp Ther244:1150-6 (1988) Adenosine receptor A1
Name:Adenosine receptor A1
Type:Enzyme Catalytic Domain
Mol. Mass.:36337.19
Organism:Chick
Description:ADENOSINE A1 ADORA1 Chick::P49892
Residue:324
BDBM50009552
NameBDBM50009552
Synonyms:2-[6-Amino-2-(2-morpholin-4-yl-ethylamino)-purin-9-yl]-5-hydroxymethyl-tetrahydro-furan-3,4-diol CHEMBL45891 | N6-Cyclohexylado (CHA)
TypeSmall organic molecule
Emp. Form.C16H23N5O4
Mol. Mass.349.3849
SMILESOC[C@H]1O[C@H]([C@H](O)[C@@H]1O)n1cnc2c(NC3CCCCC3)ncnc12