Reaction Details
TargetNorepinephrine transporter
LigandBDBM35229
Substrate/Competitorn/a
Ki 2.57±n/a nM
CommentsPDSP_638
Citation de Boer, THMaura, GRaiteri, Mde Vos, CJWieringa, JPinder, RM Neurochemical and autonomic pharmacological profiles of the 6-aza-analogue of mianserin, Org 3770 and its enantiomers. Neuropharmacology27:399-408 (1988) 
 
Norepinephrine transporter
Name:Norepinephrine transporter
Synonyms:n/a
Type:Enzyme Catalytic Domain
Mol. Mass.:2082.45
Organism:RAT
Description:Norepinephrine transporter 0 RAT::Q9JIA2
Residue:19
MLLARMKPQVQPELGGADQ
BDBM35229
NameBDBM35229
TypeSmall organic molecule
Emp. Form.C18H22N2
Mol. Mass.266.3807
SMILESCNCCCN1c2ccccc2CCc2ccccc12