Reaction Details
TargetNicotinic acetylcholine receptor
LigandBDBM50060582
Substrate/Competitorn/a
Ki 3125±n/a nM
CommentsPDSP_632
Citation Lippiello, PMFernandes, KG The binding of L-[3H]nicotine to a single class of high affinity sites in rat brain membranes. Mol Pharmacol29:448-54 (1986) Nicotinic acetylcholine receptor
Name:Nicotinic acetylcholine receptor
Type:Enzyme Catalytic Domain
Mol. Mass.:2478.99
Organism:RAT
Description:n-AChR 0 RAT::Q62594
Residue:23
BDBM50060582
NameBDBM50060582
Synonyms:1,10-Bis(trimethyl ammonium)decane dibromide CHEMBL1134 DECAMETHONIUM BROMIDE N,N,N'',N''-Tetramethyl-decane-1,10-diammonium; dibromide Syncurine | decane-1,10-bis(trimethylammonium bromide)
TypeSmall organic molecule
Emp. Form.C16H38N2
Mol. Mass.258.4852
SMILESC[N+](C)(C)CCCCCCCCCC[N+](C)(C)C