Reaction Details
TargetNorepinephrine transporter
LigandBDBM35229
Substrate/Competitorn/a
Ki 0.15±n/a nM
CommentsPDSP_638
Citation Muth, EAHaskins, JTMoyer, JAHusbands, GENielsen, STSigg, EB Antidepressant biochemical profile of the novel bicyclic compound Wy-45,030, an ethyl cyclohexanol derivative. Biochem Pharmacol35:4493-7 (1986) 
 
Norepinephrine transporter
Name:Norepinephrine transporter
Synonyms:n/a
Type:Enzyme Catalytic Domain
Mol. Mass.:2082.45
Organism:RAT
Description:Norepinephrine transporter 0 RAT::Q9JIA2
Residue:19
MLLARMKPQVQPELGGADQ
BDBM35229
NameBDBM35229
TypeSmall organic molecule
Emp. Form.C18H22N2
Mol. Mass.266.3807
SMILESCNCCCN1c2ccccc2CCc2ccccc12