Reaction Details
TargetBeta-arrestin-1
LigandBDBM50018550
Substrate/Competitorn/a
Ki 7276±n/a nM
CommentsPDSP_1069
Citation Bloom, JWHalonen, MLawrence, LJRould, ESeaver, NAYamamura, HI Characterization of high affinity [3H]pirenzepine and (-)-[3H] quinuclidinyl benzilate binding to muscarinic cholinergic receptors in rabbit peripheral lung. J Pharmacol Exp Ther240:51-8 (1987) Beta-arrestin-1
Name:Beta-arrestin-1
Type:Enzyme Catalytic Domain
Mol. Mass.:46360.54
Organism:RABBIT
Description:Cholinergic, muscarinic 0 RABBIT::Q95223
Residue:410
BDBM50018550
NameBDBM50018550
Synonyms:1'-Benzyl-3-phenyl-[3,4']bipiperidinyl-2,6-dione Dexetimide | Levetimide
TypeSmall organic molecule
Emp. Form.C23H26N2O2
Mol. Mass.362.4647
SMILESO=C1CC[C@](C2CCN(Cc3ccccc3)CC2)(C(=O)N1)c1ccccc1