Reaction Details
TargetD(2) dopamine receptor
LigandBDBM82073
Substrate/Competitorn/a
Ki 77±n/a nM
CommentsPDSP_1855
Citation Imafuku, J The characterization of [3H]sulpiride binding sites in rat striatal membranes. Brain Res402:331-8 (1987) 
 
D(2) dopamine receptor
Name:D(2) dopamine receptor
Type:G Protein-Coupled Receptor (GPCR)
Mol. Mass.:50931.60
Organism:Rattus norvegicus (rat)
Description:P61169
Residue:444
BDBM82073
NameBDBM82073
Synonyms:CAS_51012-32-9 Tiapride
TypeSmall organic molecule
Emp. Form.C15H24N2O4S
Mol. Mass.328.427
SMILESCCN(CC)CCNC(=O)c1cc(ccc1OC)S(C)(=O)=O