Reaction Details
TargetMuscarinic acetylcholine receptor M2
LigandBDBM86231
Substrate/Competitorn/a
Ki 1±n/a nM
CommentsPDSP_334
Citation Yamamura, HISnyder, SH Muscarinic cholinergic binding in rat brain. Proc Natl Acad Sci U S A71:1725-9 (1974) 
 
Muscarinic acetylcholine receptor M2
Name:Muscarinic acetylcholine receptor M2
Type:Enzyme Catalytic Domain
Mol. Mass.:51555.53
Organism:RAT
Description:P10980
Residue:466
BDBM86231
NameBDBM86231
Synonyms:ATR Atropine,(-) CHEMBL195 US9333195, ATROPINE
TypeSmall organic molecule
Emp. Form.C17H23NO3
Mol. Mass.289.3694
SMILESCN1C2CCC1CC(C2)OC(=O)C(CO)c1ccccc1