Reaction Details
TargetSigma non-opioid intracellular receptor 1
LigandBDBM50001031
Substrate/Competitorn/a
Ki 343±n/a nM
CommentsPDSP_1715
Citation Largent, BLGundlach, ALSnyder, SH Psychotomimetic opiate receptors labeled and visualized with (+)-[3H]3-(3-hydroxyphenyl)-N-(1-propyl)piperidine. Proc Natl Acad Sci U S A81:4983-7 (1984) 
 
Sigma non-opioid intracellular receptor 1
Name:Sigma non-opioid intracellular receptor 1
Type:Enzyme Catalytic Domain
Mol. Mass.:25266.54
Organism:RAT
Description:Q9R0C9
Residue:223
BDBM50001031
NameBDBM50001031
Synonyms:3-Allyl-6,11-dimethyl-1,2,3,4,5,6-hexahydro-2,6-methano-benzo[d]azocin-8-ol SKF 10,047 (+) SKF 10047
TypeSmall organic molecule
Emp. Form.C17H23NO
Mol. Mass.257.3706
SMILESC[C@H]1[C@H]2Cc3ccc(O)cc3[C@@]1(C)CCN2CC=C