Reaction Details
TargetSodium-dependent dopamine transporter
LigandBDBM22417
Substrate/Competitorn/a
Ki 1750±n/a nM
CommentsPDSP_1153
Citation Wong, DTThrelkeld, PGBest, KLBymaster, FP A new inhibitor of norepinephrine uptake devoid of affinity for receptors in rat brain. J Pharmacol Exp Ther222:61-5 (1982) Sodium-dependent dopamine transporter
Name:Sodium-dependent dopamine transporter
Type:Multi-pass membrane protein
Mol. Mass.:68749.45
Organism:Rattus norvegicus (rat)
Description:P23977
Residue:619
BDBM22417
NameBDBM22417
Synonyms:3-(2-methoxyphenoxy)-N-methyl-3-phenylpropan-1-amine LY 135252 LY135252 Nisoxetine US9944618, Compound ID No. 177 [3H]Nisoxetine
Typeradiolabeled ligand
Emp. Form.C17H21NO2
Mol. Mass.271.3541
SMILESCNCCC(Oc1ccccc1OC)c1ccccc1