Reaction Details
TargetNorepinephrine transporter
LigandBDBM22417
Substrate/Competitorn/a
Ki 3.4±n/a nM
CommentsPDSP_1153
Citation Wong, DTThrelkeld, PGBest, KLBymaster, FP A new inhibitor of norepinephrine uptake devoid of affinity for receptors in rat brain. J Pharmacol Exp Ther222:61-5 (1982) Norepinephrine transporter
Name:Norepinephrine transporter
Synonyms:n/a
Type:Enzyme Catalytic Domain
Mol. Mass.:2082.45
Organism:RAT
Description:Norepinephrine transporter 0 RAT::Q9JIA2
Residue:19
MLLARMKPQVQPELGGADQ
BDBM22417
NameBDBM22417
Typeradiolabeled ligand
Emp. Form.C17H21NO2
Mol. Mass.271.3541
SMILESCNCCC(Oc1ccccc1OC)c1ccccc1