Reaction Details
TargetBroad substrate specificity ATP-binding cassette transporter ABCG2
LigandBDBM106209
Substrate/Competitorn/a
Meas. Tech.Caco-2 cells assay
pH7.4±n/a
Temperature310.15±n/a K
IC50>10000±0.0 nM
Commentsextracted
Citation Li, YPrakash, SRXia, CQLiao, MM Inhibitor of breast cancer resistance protein (BCRP) US Patent US9695174 Publication Date 7/4/2017
 
Broad substrate specificity ATP-binding cassette transporter ABCG2
Name:Broad substrate specificity ATP-binding cassette transporter ABCG2
Type:Multi-pass membrane protein; monomer or homodimer; disulfide-linked
Mol. Mass.:72329.48
Organism:Homo sapiens (Human)
Description:Q9UNQ0
Residue:655
BDBM106209
NameBDBM106209
Synonyms:US9695174, 4
TypeSmall organic molecule
Emp. Form.C20H25N3O3
Mol. Mass.355.4308
SMILESCOc1ccc2c3C[C@H]4N([C@@H](CC(C)C)c3[nH]c2c1)C(=O)[C@H](C)NC4=O