Reaction Details
TargetHistamine H2 receptor
LigandBDBM22883
Substrate/Competitorn/a
Ki>10000±n/a nM
CommentsPDSP_671
Citation Gajtkowski, GANorris, DBRising, TJWood, TP Specific binding of 3H-tiotidine to histamine H2 receptors in guinea pig cerebral cortex. Nature304:65-7 (1983) 
 
Histamine H2 receptor
Name:Histamine H2 receptor
Type:G Protein-Coupled Receptor (GPCR)
Mol. Mass.:40567.22
Organism:Cavia porcellus (domestic guinea pig)
Description:For the H2 receptor-binding assays, guinea pig striatum was used.
Residue:359
BDBM22883
NameBDBM22883
Synonyms:CHEMBL12344 [3-(carbamimidoylsulfanyl)propyl]dimethylamine
TypeSmall organic molecule
Emp. Form.C6H15N3S
Mol. Mass.161.268
SMILESCN(C)CCCSC(N)=N