Reaction Details
TargetHistamine H1 receptor
LigandBDBM22889
Substrate/Competitorn/a
Ki>10000±n/a nM
CommentsPDSP_519
Citation Kanba, SRichelson, E Histamine H1 receptors in human brain labelled with [3H]doxepin. Brain Res304:1-7 (1984) 
 
Histamine H1 receptor
Name:Histamine H1 receptor
Type:G Protein-Coupled Receptor (GPCR)
Mol. Mass.:55808.72
Organism:Homo sapiens (Human)
Description:Cell pellets from SK-N-MC cells transfected with human H1 receptor were used in binding assay.
Residue:487
BDBM22889
NameBDBM22889
Synonyms:(Cimetidine) N-Methyl-N''''-[2-(5-methyl-1H-imidazol-4-ylmethylsulfanyl)-ethyl]-guanidine,cyanide (cimetidine) N-methyl-N-[2-(5-methyl-1H-4-imidazolylmethylsulfanyl)ethyl]cyanoiminomethanediamine 1-cyano-2-methyl-3-(2-{[(5-methyl-1H-imidazol-4-yl)methyl]sulfanyl}ethyl)guanidine 2-Methyl-8-phenethyl-imidazo[1,2-a]pyridine-3-carboxylic acid methyl ester(cimetidine) 2-methylamino-2-[2-(5-methyl-1H-4-imidazolylmethylsulfanyl)ethylamino]-(Z)-1-imino cyanide(cimetidine) CHEMBL30 Eureceptor N''''''''-cyano-N-methyl-N''''-(2-{[(5-methyl-1H-imidazol-4-yl)methyl]-lambda~4~-sulfanyl}ethyl)guanidine N''''''''-cyano-N-methyl-N''''-(2-{[(5-methyl-1H-imidazol-4-yl)methyl]thio}ethyl)guanidine (Cimetidine) N''''''''-cyano-N-methyl-N''''-({[(5-methyl-1H-imidazol-4-yl)methyl]thio}methyl)guanidine(cimetidine) N-Methyl-N''''-[2-(5-methyl-1H-imidazol-4-ylmethylsulfanyl)-ethyl]-N''''''''-Cyano-guanidine N-Methyl-N''''-[2-(5-methyl-1H-imidazol-4-ylmethylsulfanyl)-ethyl]-cyanoguanidine(cimetidine) N-methyl-N''''-cyano-N''''''''-[2-(5-methyl-1H-imidazol-4-ylmethylsulfanyl)-ethyl]-guanidine N-methyl-N-[2-(5-methyl-1H-4-imidazolylmethylsulfanyl)ethyl]cyanoiminomethanediamine (cimetidine) N-tert-Butyl-N''''-[4-(1H-imidazol-4-yl)-phenyl]-formamidine(cimetidine) Tagamet HB cemitidine
TypeSmall organic molecule
Emp. Form.C10H16N6S
Mol. Mass.252.339
SMILESCNC(NC#N)=NCCSCc1[nH]cnc1C