Reaction Details
TargetHistamine H1 receptor
LigandBDBM22568
Substrate/Competitorn/a
Ki>10000±n/a nM
CommentsPDSP_1859
Citation Kanba, SRichelson, E Histamine H1 receptors in human brain labelled with [3H]doxepin. Brain Res304:1-7 (1984) 
 
Histamine H1 receptor
Name:Histamine H1 receptor
Type:G Protein-Coupled Receptor (GPCR)
Mol. Mass.:55808.72
Organism:Homo sapiens (Human)
Description:Cell pellets from SK-N-MC cells transfected with human H1 receptor were used in binding assay.
Residue:487
BDBM22568
NameBDBM22568
Synonyms:1-cyano-3-{2-[({2-[(diaminomethylidene)amino]-1,3-thiazol-4-yl}methyl)sulfanyl]ethyl}-2-methylguanidine tiotidine
TypeSmall organic molecule
Emp. Form.C10H16N8S2
Mol. Mass.312.418
SMILES[#6]-[#7]-[#6](-[#7]C#N)=[#7]-[#6]-[#6]-[#16]-[#6]-c1csc(\[#7]=[#6](\[#7])-[#7])n1