Reaction Details
TargetHistamine H1 receptor
LigandBDBM50131440
Substrate/Competitorn/a
Ki 1.8±n/a nM
CommentsPDSP_1205
Citation Richelson, ENelson, A Antagonism by neuroleptics of neurotransmitter receptors of normal human brain in vitro. Eur J Pharmacol103:197-204 (1984) 
 
Histamine H1 receptor
Name:Histamine H1 receptor
Type:G Protein-Coupled Receptor (GPCR)
Mol. Mass.:55808.72
Organism:Homo sapiens (Human)
Description:Cell pellets from SK-N-MC cells transfected with human H1 receptor were used in binding assay.
Residue:487
BDBM50131440
NameBDBM50131440
Synonyms:10-(2-(1-methylpiperidin-2-yl)ethyl)-2-(methylsulfinyl)-10H-phenothiazine CHEMBL1088 NC-123 TPS-23
TypeSmall organic molecule
Emp. Form.C21H26N2OS2
Mol. Mass.386.574
SMILESCN1CCCCC1CCN1c2ccccc2Sc2ccc(cc12)S(C)=O