Reaction Details
Target5-hydroxytryptamine receptor 1A
LigandBDBM30707
Substrate/Competitorn/a
Ki 39.81±n/a nM
CommentsPDSP_2793
Citation Gozlan, HEl Mestikawy, SPichat, LGlowinski, JHamon, M Identification of presynaptic serotonin autoreceptors using a new ligand: 3H-PAT. Nature305:140-2 (1983) 
 
5-hydroxytryptamine receptor 1A
Name:5-hydroxytryptamine receptor 1A
Type:G Protein-Coupled Receptor (GPCR)
Mol. Mass.:46445.29
Organism:Rattus norvegicus (rat)
Description:Binding assays were performed using rat hippocampal membranes.
Residue:422
BDBM30707
NameBDBM30707
Synonyms:2-(5-methoxy-1H-indol-3-yl)-N,N-dimethyl-ethanamine 2-(5-methoxy-1H-indol-3-yl)ethyl-dimethyl-amine CHEMBL7257 Methoxydimethyltryptamines WO2023019367, Compound 5-MeO-DMT | cid_1832
TypeSmall organic molecule
Emp. Form.C13H18N2O
Mol. Mass.218.2948
SMILESCOc1ccc2[nH]cc(CCN(C)C)c2c1