Reaction Details
Target5-hydroxytryptamine receptor 1A
LigandBDBM50001859
Substrate/Competitorn/a
Ki 29.51±n/a nM
CommentsPDSP_446
Citation Gozlan, HEl Mestikawy, SPichat, LGlowinski, JHamon, M Identification of presynaptic serotonin autoreceptors using a new ligand: 3H-PAT. Nature305:140-2 (1983) 
 
5-hydroxytryptamine receptor 1A
Name:5-hydroxytryptamine receptor 1A
Type:G Protein-Coupled Receptor (GPCR)
Mol. Mass.:46445.29
Organism:Rattus norvegicus (rat)
Description:Binding assays were performed using rat hippocampal membranes.
Residue:422
BDBM50001859
NameBDBM50001859
Synonyms:(buspirone) 8-[4-(4-Pyrimidin-2-yl-piperazin-1-yl)-butyl]-8-aza-spiro[4.5]decane-7,9-dione 8-[4-(4-Pyrimidin-2-yl-piperazin-1-yl)-butyl]-8-aza-spiro[4.5]decane-7,9-dione; Hydrochloride(Buspirone) BUSPAR CHEMBL49 | US10562853, Compound Buspirone
TypeSmall organic molecule
Emp. Form.C21H31N5O2
Mol. Mass.385.5031
SMILESO=C1CC2(CCCC2)CC(=O)N1CCCCN1CCN(CC1)c1ncccn1