Reaction Details
Target5-hydroxytryptamine receptor 1A
LigandBDBM21398
Substrate/Competitorn/a
Ki 3548.13±n/a nM
CommentsPDSP_918
Citation Gozlan, HEl Mestikawy, SPichat, LGlowinski, JHamon, M Identification of presynaptic serotonin autoreceptors using a new ligand: 3H-PAT. Nature305:140-2 (1983) 
 
5-hydroxytryptamine receptor 1A
Name:5-hydroxytryptamine receptor 1A
Type:G Protein-Coupled Receptor (GPCR)
Mol. Mass.:46445.29
Organism:Rattus norvegicus (rat)
Description:Binding assays were performed using rat hippocampal membranes.
Residue:422
BDBM21398
NameBDBM21398
Synonyms:4-[4-(4-Chloro-phenyl)-4-hydroxy-piperidin-1-yl]-1-(4-fluoro-phenyl)-butan-1-one;propionate(HCl) CHEMBL54 Haloperidol | Haloperidol, 1
TypeSmall organic molecule
Emp. Form.C21H23ClFNO2
Mol. Mass.375.864
SMILESOC1(CCN(CCCC(=O)c2ccc(F)cc2)CC1)c1ccc(Cl)cc1