Reaction Details
Target5-hydroxytryptamine receptor 1A
LigandBDBM81498
Substrate/Competitorn/a
Ki 9.77±n/a nM
CommentsPDSP_1643
Citation Gozlan, HEl Mestikawy, SPichat, LGlowinski, JHamon, M Identification of presynaptic serotonin autoreceptors using a new ligand: 3H-PAT. Nature305:140-2 (1983) 
 
5-hydroxytryptamine receptor 1A
Name:5-hydroxytryptamine receptor 1A
Type:G Protein-Coupled Receptor (GPCR)
Mol. Mass.:46445.29
Organism:Rattus norvegicus (rat)
Description:Binding assays were performed using rat hippocampal membranes.
Residue:422
BDBM81498
NameBDBM81498
Synonyms:5-Methoxy-3-(1,2,3,6-tetrahydro-pyridin-4-yl)-1H-indole(RU-24969) CHEMBL18785 RU 24969
TypeSmall organic molecule
Emp. Form.C14H16N2O
Mol. Mass.228.2896
SMILESCOc1ccc2[nH]cc(C3=CCNCC3)c2c1