Reaction Details
TargetOpioid receptor delta 1
LigandBDBM21025
Substrate/Competitorn/a
Ki 1.8±n/a nM
CommentsPDSP_614
Citation Leslie, FMChavkin, CCox, BM Opioid binding properties of brain and peripheral tissues: evidence for heterogeneity in opioid ligand binding sites. J Pharmacol Exp Ther214:395-402 (1980) Opioid receptor delta 1
Name:Opioid receptor delta 1
Synonyms:n/a
Type:PROTEIN
Mol. Mass.:40708.41
Organism:Bos taurus
Description:ChEMBL_863801
Residue:372
BDBM21025
NameBDBM21025
TypeANALGESIC
Emp. Form.C29H39N5O7
Mol. Mass.569.6493
SMILESCC(C)C[C@@H](NC(=O)[C@H](Cc1ccccc1)NC(=O)CNC(=O)[C@@H](C)NC(=O)[C@@H](N)Cc1ccc(O)cc1)C(O)=O