Reaction Details
TargetMu-type opioid receptor
LigandBDBM82090
Substrate/Competitorn/a
Ki 18.2±n/a nM
CommentsPDSP_2915
Citation Leslie, FMChavkin, CCox, BM Opioid binding properties of brain and peripheral tissues: evidence for heterogeneity in opioid ligand binding sites. J Pharmacol Exp Ther214:395-402 (1980) Mu-type opioid receptor
Name:Mu-type opioid receptor
Type:Enzyme Catalytic Domain
Mol. Mass.:11165.58
Organism:GUINEA PIG
Description:P97266
Residue:98
BDBM82090
NameBDBM82090
Synonyms:DALLE
TypeSmall organic molecule
Emp. Form.C29H39N5O7
Mol. Mass.569.6493
SMILESCC(C)C[C@H](NC(=O)[C@H](Cc1ccccc1)NC(=O)CNC(=O)[C@@H](C)NC(=O)[C@@H](N)Cc1ccc(O)cc1)C(O)=O