Reaction Details
TargetProstacyclin receptor
LigandBDBM82098
Substrate/Competitorn/a
Ki 735±n/a nM
CommentsPDSP_5305
Citation Blair, IAMacDermot, J The binding of [3H]-prostacyclin to membranes of a neuronal somatic hybrid. Br J Pharmacol72:435-41 (1981) 
 
Prostacyclin receptor
Name:Prostacyclin receptor
Type:G Protein-Coupled Receptor (GPCR)
Mol. Mass.:40968.22
Organism:Homo sapiens (Human)
Description:The membranes prepared from human platelet were used in binding assay.
Residue:386
BDBM82098
NameBDBM82098
Synonyms:8-ISO PROSTAGLANDIN E1 PGE1, 8-iso
TypeSmall organic molecule
Emp. Form.C20H34O5
Mol. Mass.354.481
SMILESCCCCC[C@H](O)\C=C\C1[C@H](O)CC(=O)[C@H]1CCCCCCC(O)=O