Reaction Details
TargetProstacyclin receptor
LigandBDBM82093
Substrate/Competitorn/a
Ki>10000±n/a nM
CommentsPDSP_5308
Citation Blair, IAMacDermot, J The binding of [3H]-prostacyclin to membranes of a neuronal somatic hybrid. Br J Pharmacol72:435-41 (1981) 
 
Prostacyclin receptor
Name:Prostacyclin receptor
Type:G Protein-Coupled Receptor (GPCR)
Mol. Mass.:40968.22
Organism:Homo sapiens (Human)
Description:The membranes prepared from human platelet were used in binding assay.
Residue:386
BDBM82093
NameBDBM82093
Synonyms:13,14-DIHYDRO-15-KETO PROSTAGLANDIN E2 CAS_363-23-5 PGE2, 13,14-dihydro15-oxo
TypeSmall organic molecule
Emp. Form.C20H32O5
Mol. Mass.352.4651
SMILESCCCCCC(=O)CC[C@H]1[C@H](O)CC(=O)[C@@H]1C\C=C/CCCC(O)=O